Reaction Details
TargetMu-type opioid receptor
LigandBDBM50097579
Substrate/Competitorn/a
Meas. Tech.ChEMBL_533284 (CHEMBL973302)
Ki 0.310000±n/a nM
Citation Wentland, MPSun, XCohen, DJBidlack, JM Redefining the structure-activity relationships of 2,6-methano-3-benzazocines. Part 6: Opioid receptor binding properties of cyclic variants of 8-carboxamidocyclazocine. Bioorg Med Chem16:5653-64 (2008) 
 
Mu-type opioid receptor
Name:Mu-type opioid receptor
Type:G Protein-Coupled Receptor (GPCR)
Mol. Mass.:44789.51
Organism:Homo sapiens (Human)
Description:P35372
Residue:400
BDBM50097579
NameBDBM50097579
Synonyms:(6S,11R)-3-Cyclopropylmethyl-6,11-dimethyl-1,2,3,4,5,6-hexahydro-2,6-methano-benzo[d]azocine-8-carboxylic acid amide 8-carboxamidocyclazocine US9656961, Example 00157
TypeSmall organic molecule
Emp. Form.C19H26N2O
Mol. Mass.298.4225
SMILESC[C@H]1C2Cc3ccc(cc3[C@@]1(C)CCN2CC1CC1)C(N)=O