Reaction Details
TargetMu-type opioid receptor
LigandBDBM50261626
Substrate/Competitorn/a
Meas. Tech.ChEMBL_533284 (CHEMBL973302)
Ki 170±n/a nM
Citation Wentland, MPSun, XCohen, DJBidlack, JM Redefining the structure-activity relationships of 2,6-methano-3-benzazocines. Part 6: Opioid receptor binding properties of cyclic variants of 8-carboxamidocyclazocine. Bioorg Med Chem16:5653-64 (2008) 
 
Mu-type opioid receptor
Name:Mu-type opioid receptor
Type:G Protein-Coupled Receptor (GPCR)
Mol. Mass.:44789.51
Organism:Homo sapiens (Human)
Description:P35372
Residue:400
BDBM50261626
NameBDBM50261626
Synonyms:(1S,17R)-14-(cyclopropylmethyl)-1,17-dimethyl-6,8,14-triazatetracyclo[11.3.1.0^{2,11}.0^{4,9}]heptadeca-2,4(9),7,10-tetraen-5-one | CHEMBL469188
TypeSmall organic molecule
Emp. Form.C20H25N3O
Mol. Mass.323.432
SMILESC[C@H]1C2Cc3cc4nc[nH]c(=O)c4cc3[C@@]1(C)CCN2CC1CC1