Reaction Details
TargetKappa-type opioid receptor
LigandBDBM50261180
Substrate/Competitorn/a
Meas. Tech.ChEMBL_533286 (CHEMBL973305)
Ki 0.740000±n/a nM
Citation Wentland, MPSun, XCohen, DJBidlack, JM Redefining the structure-activity relationships of 2,6-methano-3-benzazocines. Part 6: Opioid receptor binding properties of cyclic variants of 8-carboxamidocyclazocine. Bioorg Med Chem16:5653-64 (2008) 
 
Kappa-type opioid receptor
Name:Kappa-type opioid receptor
Type:G Protein-Coupled Receptor (GPCR)
Mol. Mass.:42648.76
Organism:Homo sapiens (Human)
Description:P41145
Residue:380
BDBM50261180
NameBDBM50261180
Synonyms:(1S,17R)-14-(cyclopropylmethyl)-1,17-dimethyl-6,14-diazatetracyclo[11.3.1.0^{2,11}.0^{4,9}]heptadeca-2,4(9),7,10-tetraen-5-one | CHEMBL493621
TypeSmall organic molecule
Emp. Form.C21H26N2O
Mol. Mass.322.4439
SMILESC[C@H]1C2Cc3cc4cc[nH]c(=O)c4cc3[C@@]1(C)CCN2CC1CC1