Reaction Details
TargetKappa-type opioid receptor
LigandBDBM50261628
Substrate/Competitorn/a
Meas. Tech.ChEMBL_533286 (CHEMBL973305)
IC50 1300±n/a nM
Citation Wentland, MPSun, XCohen, DJBidlack, JM Redefining the structure-activity relationships of 2,6-methano-3-benzazocines. Part 6: Opioid receptor binding properties of cyclic variants of 8-carboxamidocyclazocine. Bioorg Med Chem16:5653-64 (2008) 
 
Kappa-type opioid receptor
Name:Kappa-type opioid receptor
Type:G Protein-Coupled Receptor (GPCR)
Mol. Mass.:42648.76
Organism:Homo sapiens (Human)
Description:P41145
Residue:380
BDBM50261628
NameBDBM50261628
Synonyms:(1S,17R)-14-(cyclopropylmethyl)-1,17-dimethyl-4,6,14-triazatetracyclo[11.3.1.0^{2,11}.0^{3,8}]heptadeca-2,4,6,8,10-pentaen-7-amine | CHEMBL469189
TypeSmall organic molecule
Emp. Form.C20H26N4
Mol. Mass.322.4472
SMILESC[C@H]1C2Cc3ccc4c(N)ncnc4c3[C@@]1(C)CCN2CC1CC1