Reaction Details
TargetCannabinoid receptor 2
LigandBDBM50260710
Substrate/Competitorn/a
Meas. Tech.ChEMBL_552264 (CHEMBL995594)
Ki 242±n/a nM
Citation Omura, HKawai, MShima, AIwata, YIto, FMasuda, TOhta, AMakita, NOmoto, KSugimoto, HKikuchi, AIwata, HAndo, K The SAR studies of novel CB2 selective agonists, benzimidazolone derivatives. Bioorg Med Chem Lett18:3310-4 (2008) 
 
Cannabinoid receptor 2
Name:Cannabinoid receptor 2
Type:G Protein-Coupled Receptor (GPCR)
Mol. Mass.:39690.94
Organism:Homo sapiens (Human)
Description:P34972
Residue:360
BDBM50260710
NameBDBM50260710
Synonyms:(S)-N-(1-amino-3,3-dimethyl-1-oxobutan-2-yl)-2-oxo-3-(2-(pyrrolidin-1-yl)ethyl)-2,3-dihydrobenzo[d]imidazole-1-carboxamide | CHEMBL524818
TypeSmall organic molecule
Emp. Form.C20H29N5O3
Mol. Mass.387.476
SMILESCC(C)(C)[C@H](NC(=O)n1c2ccccc2n(CCN2CCCC2)c1=O)C(N)=O