Reaction Details
TargetCannabinoid receptor 2
LigandBDBM50261101
Substrate/Competitorn/a
Meas. Tech.ChEMBL_552264 (CHEMBL995594)
IC50>1000±n/a nM
Citation Omura, HKawai, MShima, AIwata, YIto, FMasuda, TOhta, AMakita, NOmoto, KSugimoto, HKikuchi, AIwata, HAndo, K The SAR studies of novel CB2 selective agonists, benzimidazolone derivatives. Bioorg Med Chem Lett18:3310-4 (2008) 
 
Cannabinoid receptor 2
Name:Cannabinoid receptor 2
Type:G Protein-Coupled Receptor (GPCR)
Mol. Mass.:39690.94
Organism:Homo sapiens (Human)
Description:P34972
Residue:360
BDBM50261101
NameBDBM50261101
Synonyms:CHEMBL523875 | N-cyclohexyl-N-methyl-3-(2-morpholinoethyl)-2-oxo-2,3-dihydrobenzo[d]imidazole-1-carboxamide
TypeSmall organic molecule
Emp. Form.C21H30N4O3
Mol. Mass.386.4879
SMILESCN(C1CCCCC1)C(=O)n1c2ccccc2n(CCN2CCOCC2)c1=O