Reaction Details
TargetCannabinoid receptor 1
LigandBDBM50261052
Substrate/Competitorn/a
Meas. Tech.ChEMBL_552268 (CHEMBL995598)
Ki 1730±n/a nM
Citation Omura, HKawai, MShima, AIwata, YIto, FMasuda, TOhta, AMakita, NOmoto, KSugimoto, HKikuchi, AIwata, HAndo, K The SAR studies of novel CB2 selective agonists, benzimidazolone derivatives. Bioorg Med Chem Lett18:3310-4 (2008) 
 
Cannabinoid receptor 1
Name:Cannabinoid receptor 1
Type:G Protein-Coupled Receptor (GPCR)
Mol. Mass.:52868.96
Organism:Homo sapiens (Human)
Description:P21554
Residue:472
BDBM50261052
NameBDBM50261052
Synonyms:(R)-3-(2-morpholinoethyl)-2-oxo-N-(1,2,3,4-tetrahydronaphthalen-1-yl)-2,3-dihydrobenzo[d]imidazole-1-carboxamide | CHEMBL523708
TypeSmall organic molecule
Emp. Form.C24H28N4O3
Mol. Mass.420.5041
SMILESO=C(N[C@@H]1CCCc2ccccc12)n1c2ccccc2n(CCN2CCOCC2)c1=O