Reaction Details
TargetCannabinoid receptor 1
LigandBDBM50260672
Substrate/Competitorn/a
Meas. Tech.ChEMBL_552268 (CHEMBL995598)
IC50>10000±n/a nM
Citation Omura, HKawai, MShima, AIwata, YIto, FMasuda, TOhta, AMakita, NOmoto, KSugimoto, HKikuchi, AIwata, HAndo, K The SAR studies of novel CB2 selective agonists, benzimidazolone derivatives. Bioorg Med Chem Lett18:3310-4 (2008) 
 
Cannabinoid receptor 1
Name:Cannabinoid receptor 1
Type:G Protein-Coupled Receptor (GPCR)
Mol. Mass.:52868.96
Organism:Homo sapiens (Human)
Description:P21554
Residue:472
BDBM50260672
NameBDBM50260672
Synonyms:(S)-N-(1-cyano-2,2-dimethylpropyl)-3-(2-morpholinoethyl)-2-oxo-2,3-dihydrobenzo[d]imidazole-1-carboxamide | CHEMBL494986
TypeSmall organic molecule
Emp. Form.C20H27N5O3
Mol. Mass.385.4601
SMILESCC(C)(C)[C@H](NC(=O)n1c2ccccc2n(CCN2CCOCC2)c1=O)C#N