Reaction Details
TargetCannabinoid receptor 1
LigandBDBM50260718
Substrate/Competitorn/a
Meas. Tech.ChEMBL_556337 (CHEMBL954070)
Ki 1.66±n/a nM
Citation Wustrow, DJMaynard, GDYuan, JZhao, HMao, JGuo, QKershaw, MHammer, JBrodbeck, RMNear, KEZhou, DBeers, DSChenard, BLKrause, JEHutchison, AJ Aminopyrazine CB1 receptor inverse agonists. Bioorg Med Chem Lett18:3376-81 (2008) 
 
Cannabinoid receptor 1
Name:Cannabinoid receptor 1
Type:G Protein-Coupled Receptor (GPCR)
Mol. Mass.:52868.96
Organism:Homo sapiens (Human)
Description:P21554
Residue:472
BDBM50260718
NameBDBM50260718
Synonyms:1-(6-(2-chlorophenyl)-5-(4-chlorophenyl)pyrazin-2-yl)-4-(ethylamino)piperidine-4-carboxamide | CHEMBL522720
TypeSmall organic molecule
Emp. Form.C24H25Cl2N5O
Mol. Mass.470.394
SMILESCCNC1(CCN(CC1)c1cnc(-c2ccc(Cl)cc2)c(n1)-c1ccccc1Cl)C(N)=O