Reaction Details
TargetCannabinoid receptor 1
LigandBDBM50260681
Substrate/Competitorn/a
Meas. Tech.ChEMBL_556340 (CHEMBL954073)
IC50 4.2±n/a nM
Citation Wustrow, DJMaynard, GDYuan, JZhao, HMao, JGuo, QKershaw, MHammer, JBrodbeck, RMNear, KEZhou, DBeers, DSChenard, BLKrause, JEHutchison, AJ Aminopyrazine CB1 receptor inverse agonists. Bioorg Med Chem Lett18:3376-81 (2008) 
 
Cannabinoid receptor 1
Name:Cannabinoid receptor 1
Type:G Protein-Coupled Receptor (GPCR)
Mol. Mass.:52868.96
Organism:Homo sapiens (Human)
Description:P21554
Residue:472
BDBM50260681
NameBDBM50260681
Synonyms:4-[6-(3-Chloro-pyridin-4-yl)-5-(4-trifluoromethyl-phenyl)-pyrazin-2-yl]-thiomorpholine 1,1-dioxide | CHEMBL496091
TypeSmall organic molecule
Emp. Form.C20H16ClF3N4O2S
Mol. Mass.468.88
SMILESFC(F)(F)c1ccc(cc1)-c1ncc(nc1-c1ccncc1Cl)N1CCS(=O)(=O)CC1