Reaction Details
TargetCannabinoid receptor 1
LigandBDBM50260765
Substrate/Competitorn/a
Meas. Tech.ChEMBL_556337 (CHEMBL954070)
Ki 32.33±n/a nM
Citation Wustrow, DJMaynard, GDYuan, JZhao, HMao, JGuo, QKershaw, MHammer, JBrodbeck, RMNear, KEZhou, DBeers, DSChenard, BLKrause, JEHutchison, AJ Aminopyrazine CB1 receptor inverse agonists. Bioorg Med Chem Lett18:3376-81 (2008) 
 
Cannabinoid receptor 1
Name:Cannabinoid receptor 1
Type:G Protein-Coupled Receptor (GPCR)
Mol. Mass.:52868.96
Organism:Homo sapiens (Human)
Description:P21554
Residue:472
BDBM50260765
NameBDBM50260765
Synonyms:1-(5-(4-chlorophenyl)-6-(4-cyanophenyl)pyrazin-2-yl)-4-(ethylamino)piperidine-4-carboxamide | CHEMBL496506
TypeSmall organic molecule
Emp. Form.C25H25ClN6O
Mol. Mass.460.959
SMILESCCNC1(CCN(CC1)c1cnc(-c2ccc(Cl)cc2)c(n1)-c1ccc(cc1)C#N)C(N)=O