Reaction Details
Target5-hydroxytryptamine receptor 2A
LigandBDBM50016900
Substrate/Competitorn/a
Meas. Tech.ChEMBL_556494 (CHEMBL956489)
Ki 24±n/a nM
Citation Nichols, DEFrescas, SPChemel, BRRehder, KSZhong, DLewin, AH High specific activity tritium-labeled N-(2-methoxybenzyl)-2,5-dimethoxy-4-iodophenethylamine (INBMeO): a high-affinity 5-HT2A receptor-selective agonist radioligand. Bioorg Med Chem16:6116-23 (2008) 
 
5-hydroxytryptamine receptor 2A
Name:5-hydroxytryptamine receptor 2A
Type:undefined
Mol. Mass.:52607.65
Organism:Homo sapiens (Human)
Description:P28223
Residue:471
BDBM50016900
NameBDBM50016900
Synonyms:(E)-N-[2-(3-Dimethylamino-propylsulfanyl)-phenyl]-3-phenyl-acrylamide CINANSERIN N-[2-(3-Dimethylamino-propylsulfanyl)-phenyl]-3-phenyl-acrylamide N-[2-(3-Dimethylamino-propylsulfanyl)-phenyl]-3-phenyl-acrylamide(Cinanserin) | acs.jmedchem.1c00409_ST.370
TypeSmall organic molecule
Emp. Form.C20H24N2OS
Mol. Mass.340.482
SMILESCN(C)CCCSc1ccccc1NC(=O)\C=C\c1ccccc1