Reaction Details
TargetMuscarinic acetylcholine receptor M5
LigandBDBM50271706
Substrate/Competitorn/a
Meas. Tech.ChEMBL_556758 (CHEMBL960609)
Ki>500±n/a nM
Citation Nichols, DEFrescas, SPChemel, BRRehder, KSZhong, DLewin, AH High specific activity tritium-labeled N-(2-methoxybenzyl)-2,5-dimethoxy-4-iodophenethylamine (INBMeO): a high-affinity 5-HT2A receptor-selective agonist radioligand. Bioorg Med Chem16:6116-23 (2008) 
 
Muscarinic acetylcholine receptor M5
Name:Muscarinic acetylcholine receptor M5
Type:PROTEIN
Mol. Mass.:60102.35
Organism:Homo sapiens (Human)
Description:ChEMBL_1517990
Residue:532
BDBM50271706
NameBDBM50271706
Synonyms:CHEMBL482496 | N-(2-[3H-OCH3]benzyl)-2-(2-[3H-OCH3]-5-methoxy-4-iodophenyl)ethylamine
TypeSmall organic molecule
Emp. Form.C18H22INO3
Mol. Mass.427.2767
SMILESCOc1ccccc1CNCCc1cc(OC)c(I)cc1OC