Reaction Details
TargetHistamine H3 receptor
LigandBDBM50271706
Substrate/Competitorn/a
Meas. Tech.ChEMBL_556759 (CHEMBL960610)
Ki>500±n/a nM
Citation Nichols, DEFrescas, SPChemel, BRRehder, KSZhong, DLewin, AH High specific activity tritium-labeled N-(2-methoxybenzyl)-2,5-dimethoxy-4-iodophenethylamine (INBMeO): a high-affinity 5-HT2A receptor-selective agonist radioligand. Bioorg Med Chem16:6116-23 (2008) 
 
Histamine H3 receptor
Name:Histamine H3 receptor
Type:G Protein-Coupled Receptor (GPCR)
Mol. Mass.:48691.47
Organism:Homo sapiens (Human)
Description:Binding assays were using CHO cells stably expressing hH3R receptors.
Residue:445
BDBM50271706
NameBDBM50271706
Synonyms:CHEMBL482496 | N-(2-[3H-OCH3]benzyl)-2-(2-[3H-OCH3]-5-methoxy-4-iodophenyl)ethylamine
TypeSmall organic molecule
Emp. Form.C18H22INO3
Mol. Mass.427.2767
SMILESCOc1ccccc1CNCCc1cc(OC)c(I)cc1OC