Reaction Details
TargetSodium-dependent dopamine transporter
LigandBDBM50271706
Substrate/Competitorn/a
Meas. Tech.ChEMBL_556760 (CHEMBL960611)
Ki>500±n/a nM
Citation Nichols, DEFrescas, SPChemel, BRRehder, KSZhong, DLewin, AH High specific activity tritium-labeled N-(2-methoxybenzyl)-2,5-dimethoxy-4-iodophenethylamine (INBMeO): a high-affinity 5-HT2A receptor-selective agonist radioligand. Bioorg Med Chem16:6116-23 (2008) 
 
Sodium-dependent dopamine transporter
Name:Sodium-dependent dopamine transporter
Type:Multi-pass membrane protein
Mol. Mass.:68497.11
Organism:Homo sapiens (Human)
Description:Q01959
Residue:620
BDBM50271706
NameBDBM50271706
Synonyms:CHEMBL482496 | N-(2-[3H-OCH3]benzyl)-2-(2-[3H-OCH3]-5-methoxy-4-iodophenyl)ethylamine
TypeSmall organic molecule
Emp. Form.C18H22INO3
Mol. Mass.427.2767
SMILESCOc1ccccc1CNCCc1cc(OC)c(I)cc1OC