Reaction Details
TargetTranslocator protein
LigandBDBM50255226
Substrate/Competitorn/a
Meas. Tech.ChEMBL_556775 (CHEMBL961473)
Kd 3.5±n/a nM
Citation Yu, WWang, EVoll, RJMiller, AHGoodman, MM Synthesis, fluorine-18 radiolabeling, and in vitro characterization of 1-iodophenyl-N-methyl-N-fluoroalkyl-3-isoquinoline carboxamide derivatives as potential PET radioligands for imaging peripheral benzodiazepine receptor. Bioorg Med Chem16:6145-55 (2008) 
 
Translocator protein
Name:Translocator protein
Type:Enzyme
Mol. Mass.:18834.74
Organism:Homo sapiens (Human)
Description:P30536
Residue:169
BDBM50255226
NameBDBM50255226
Synonyms:(7-chloro-N,N,5-trimethyl-4-oxo-3-phenyl-3,5-dihydro-4H-pyridazino[4,5-b]indole-1-acetamide) CHEMBL517539 | SR-180575
TypeSmall organic molecule
Emp. Form.C21H19ClN4O2
Mol. Mass.394.854
SMILESCN(C)C(=O)Cc1nn(-c2ccccc2)c(=O)c2n(C)c3cc(Cl)ccc3c12