Reaction Details
TargetAcetylcholinesterase
LigandBDBM50262988
Substrate/Competitorn/a
Meas. Tech.ChEMBL_552465 (CHEMBL999116)
Kd 46000±n/a nM
Citation Butini, SCampiani, GBorriello, MGemma, SPanico, APersico, MCatalanotti, BRos, SBrindisi, MAgnusdei, MFiorini, INacci, VNovellino, EBelinskaya, TSaxena, AFattorusso, C Exploiting protein fluctuations at the active-site gorge of human cholinesterases: further optimization of the design strategy to develop extremely potent inhibitors. J Med Chem51:3154-70 (2008) 
 
Acetylcholinesterase
Name:Acetylcholinesterase
Type:Enzyme
Mol. Mass.:68165.65
Organism:Mus musculus (mouse)
Description:n/a
Residue:614
BDBM50262988
NameBDBM50262988
Synonyms:CHEMBL1200541 ambenonium
TypeSmall organic molecule
Emp. Form.C28H42Cl2N4O2
Mol. Mass.537.564
SMILESCC[N+](CC)(CCNC(=O)C(=O)NCC[N+](CC)(CC)Cc1ccccc1Cl)Cc1ccccc1Cl