Reaction Details
TargetAcetylcholinesterase
LigandBDBM9426
Substrate/Competitorn/a
Meas. Tech.ChEMBL_555815 (CHEMBL965675)
IC50 1.50±n/a nM
Citation Butini, SCampiani, GBorriello, MGemma, SPanico, APersico, MCatalanotti, BRos, SBrindisi, MAgnusdei, MFiorini, INacci, VNovellino, EBelinskaya, TSaxena, AFattorusso, C Exploiting protein fluctuations at the active-site gorge of human cholinesterases: further optimization of the design strategy to develop extremely potent inhibitors. J Med Chem51:3154-70 (2008) 
 
Acetylcholinesterase
Name:Acetylcholinesterase
Type:Enzyme
Mol. Mass.:68193.62
Organism:Rattus norvegicus (rat)
Description:P37136
Residue:614
BDBM9426
NameBDBM9426
Synonyms:CHEMBL258928 N-(8-aminooctyl)-1,2,3,4-tetrahydroacridin-9-amine dihydrochloride | N-9-(1,2,3,4-Tetrahydroacridinyl)-1,8-diamino-octane Bis-hydrochloride
TypeSmall organic molecule
Emp. Form.C21H31N3
Mol. Mass.325.4909
SMILESNCCCCCCCCNc1c2CCCCc2nc2ccccc12