Reaction Details
TargetAcetylcholinesterase
LigandBDBM50128267
Substrate/Competitorn/a
Meas. Tech.ChEMBL_552463 (CHEMBL1002723)
Ki 26±n/a nM
Citation Butini, SCampiani, GBorriello, MGemma, SPanico, APersico, MCatalanotti, BRos, SBrindisi, MAgnusdei, MFiorini, INacci, VNovellino, EBelinskaya, TSaxena, AFattorusso, C Exploiting protein fluctuations at the active-site gorge of human cholinesterases: further optimization of the design strategy to develop extremely potent inhibitors. J Med Chem51:3154-70 (2008) 
 
Acetylcholinesterase
Name:Acetylcholinesterase
Type:n/a
Mol. Mass.:65900.74
Organism:Tetronarce californica (Pacific electric ray) (Torpedo californica)
Description:P04058
Residue:586
BDBM50128267
NameBDBM50128267
Synonyms:(4S)-4,11-DIETHYL-4-HYDROXY-3,14-DIOXO-3,4,12,14-TETRAHYDRO-1H-PYRANO[3',4':6,7]INDOLIZINO[1,2-B]QUINOLIN-9-YL 1,4'-BIPIPERIDINE-1'-CARBOXYLATE Camptosar [1,4']Bipiperidinyl-1'-carboxylic acid 4,11-diethyl-4-hydroxy-3,13-dioxo-3,4,12,13-tetrahydro-1H-2-oxa-6,12a-diaza-dibenzo[b,h]fluoren-9-yl ester | [1,4']bipiperidinyl-1'-carboxylic acid (S)-4,11-diethyl-4-hydroxy-3,13-dioxo-3,4,12,13-tetrahydro-1H-2-oxa-6,12a-diaza-dibenzo[b,h]fluoren-9-yl ester
TypeSmall organic molecule
Emp. Form.C33H38N4O6
Mol. Mass.586.678
SMILESCCc1c2Cn3c(cc4c(COC(=O)[C@]4(O)CC)c3=O)-c2nc2ccc(OC(=O)N3CCC(CC3)N3CCCCC3)cc12