Reaction Details
TargetAcetylcholinesterase
LigandBDBM50292570
Substrate/Competitorn/a
Meas. Tech.ChEMBL_552463 (CHEMBL1002723)
Ki 21±n/a nM
Citation Butini, SCampiani, GBorriello, MGemma, SPanico, APersico, MCatalanotti, BRos, SBrindisi, MAgnusdei, MFiorini, INacci, VNovellino, EBelinskaya, TSaxena, AFattorusso, C Exploiting protein fluctuations at the active-site gorge of human cholinesterases: further optimization of the design strategy to develop extremely potent inhibitors. J Med Chem51:3154-70 (2008) 
 
Acetylcholinesterase
Name:Acetylcholinesterase
Type:n/a
Mol. Mass.:65900.74
Organism:Tetronarce californica (Pacific electric ray) (Torpedo californica)
Description:P04058
Residue:586
BDBM50292570
NameBDBM50292570
Synonyms:CHEMBL538358 | decidium
TypeSmall organic molecule
Emp. Form.C32H44N4
Mol. Mass.484.7175
SMILESC[N+](C)(C)CCCCCCCCCCn1c(cc(=[NH2+])c2ccc3ccc(N)cc3c12)-c1ccccc1