Reaction Details
TargetAcetylcholinesterase
LigandBDBM50271324
Substrate/Competitorn/a
Meas. Tech.ChEMBL_552457 (CHEMBL1002717)
Ki 2.67±n/a nM
Citation Butini, SCampiani, GBorriello, MGemma, SPanico, APersico, MCatalanotti, BRos, SBrindisi, MAgnusdei, MFiorini, INacci, VNovellino, EBelinskaya, TSaxena, AFattorusso, C Exploiting protein fluctuations at the active-site gorge of human cholinesterases: further optimization of the design strategy to develop extremely potent inhibitors. J Med Chem51:3154-70 (2008) 
 
Acetylcholinesterase
Name:Acetylcholinesterase
Type:Enzyme
Mol. Mass.:67792.70
Organism:Homo sapiens (Human)
Description:P22303
Residue:614
BDBM50271324
NameBDBM50271324
Synonyms:CHEMBL482512 | N-(1,2,3,4-Tetrahydroacridin-9-yl)-N-(3-(1,2,3,4-tetrahydroacridin-9-ylsulfanyl)propyl)-1,4-butanediamine
TypeSmall organic molecule
Emp. Form.C33H40N4S
Mol. Mass.524.763
SMILESC(CCNc1c2CCCCc2nc2ccccc12)CNCCCSc1c2CCCCc2nc2ccccc12