Reaction Details
TargetAcetylcholinesterase
LigandBDBM8971
Substrate/Competitorn/a
Meas. Tech.ChEMBL_552457 (CHEMBL1002717)
Ki 27.9±n/a nM
Citation Butini, SCampiani, GBorriello, MGemma, SPanico, APersico, MCatalanotti, BRos, SBrindisi, MAgnusdei, MFiorini, INacci, VNovellino, EBelinskaya, TSaxena, AFattorusso, C Exploiting protein fluctuations at the active-site gorge of human cholinesterases: further optimization of the design strategy to develop extremely potent inhibitors. J Med Chem51:3154-70 (2008) 
 
Acetylcholinesterase
Name:Acetylcholinesterase
Type:Enzyme
Mol. Mass.:67792.70
Organism:Homo sapiens (Human)
Description:P22303
Residue:614
BDBM8971
NameBDBM8971
Synonyms:CHEMBL129108 Tacrine Dimer 4g
TypeSmall organic molecule
Emp. Form.C34H41N3S
Mol. Mass.523.774
SMILESC(CCCCSc1c2CCCCc2nc2ccccc12)CCCNc1c2CCCCc2nc2ccccc12