Reaction Details
TargetCholinesterase
LigandBDBM8977
Substrate/Competitorn/a
Meas. Tech.ChEMBL_552458 (CHEMBL1002718)
Ki 0.740±n/a nM
Citation Butini, SCampiani, GBorriello, MGemma, SPanico, APersico, MCatalanotti, BRos, SBrindisi, MAgnusdei, MFiorini, INacci, VNovellino, EBelinskaya, TSaxena, AFattorusso, C Exploiting protein fluctuations at the active-site gorge of human cholinesterases: further optimization of the design strategy to develop extremely potent inhibitors. J Med Chem51:3154-70 (2008) 
 
Cholinesterase
Name:Cholinesterase
Type:Homotetramer
Mol. Mass.:68422.27
Organism:Homo sapiens (Human)
Description:P06276
Residue:602
BDBM8977
NameBDBM8977
Synonyms:CHEMBL175949 Tacrine Dimer 4m
TypeSmall organic molecule
Emp. Form.C35H42N4OS
Mol. Mass.566.799
SMILESCC(=O)N(CCCCSc1c2CCCCc2nc2ccccc12)CCCNc1c2CCCCc2nc2ccccc12