Reaction Details
TargetCholinesterase
LigandBDBM8976
Substrate/Competitorn/a
Meas. Tech.ChEMBL_552458 (CHEMBL1002718)
Ki 8.59±n/a nM
Citation Butini, SCampiani, GBorriello, MGemma, SPanico, APersico, MCatalanotti, BRos, SBrindisi, MAgnusdei, MFiorini, INacci, VNovellino, EBelinskaya, TSaxena, AFattorusso, C Exploiting protein fluctuations at the active-site gorge of human cholinesterases: further optimization of the design strategy to develop extremely potent inhibitors. J Med Chem51:3154-70 (2008) 
 
Cholinesterase
Name:Cholinesterase
Type:Homotetramer
Mol. Mass.:68422.27
Organism:Homo sapiens (Human)
Description:P06276
Residue:602
BDBM8976
NameBDBM8976
Synonyms:CHEMBL175555 Tacrine Dimer 4l | methyl[3-(1,2,3,4-tetrahydroacridin-9-ylamino)propyl][4-(1,2,3,4-tetrahydroacridin-9-ylsulfanyl)butyl]amine
TypeSmall organic molecule
Emp. Form.C34H42N4S
Mol. Mass.538.789
SMILESCN(CCCCSc1c2CCCCc2nc2ccccc12)CCCNc1c2CCCCc2nc2ccccc12