Reaction Details
TargetCholinesterase
LigandBDBM8963
Substrate/Competitorn/a
Meas. Tech.ChEMBL_552461 (CHEMBL1002721)
Ki 2.00±n/a nM
Citation Butini, SCampiani, GBorriello, MGemma, SPanico, APersico, MCatalanotti, BRos, SBrindisi, MAgnusdei, MFiorini, INacci, VNovellino, EBelinskaya, TSaxena, AFattorusso, C Exploiting protein fluctuations at the active-site gorge of human cholinesterases: further optimization of the design strategy to develop extremely potent inhibitors. J Med Chem51:3154-70 (2008) 
 
Cholinesterase
Name:Cholinesterase
Type:Enzyme
Mol. Mass.:65643.35
Organism:Equus caballus (Horse)
Description:P81908
Residue:574
BDBM8963
NameBDBM8963
Synonyms:CHEMBL32823 N-[7-(1,2,3,4-tetrahydroacridin-9-ylamino)heptyl]-1,2,3,4-tetrahydroacridin-9-amine Tacrine-Based Inhibitor 2f | tacrine homobivalent compound 3a
TypeSmall organic molecule
Emp. Form.C33H40N4
Mol. Mass.492.6975
SMILESC(CCCNc1c2CCCCc2nc2ccccc12)CCCNc1c2CCCCc2nc2ccccc12