Reaction Details
TargetAcetylcholinesterase
LigandBDBM8974
Substrate/Competitorn/a
Meas. Tech.ChEMBL_552460 (CHEMBL1002720)
Ki 9.10±n/a nM
Citation Butini, SCampiani, GBorriello, MGemma, SPanico, APersico, MCatalanotti, BRos, SBrindisi, MAgnusdei, MFiorini, INacci, VNovellino, EBelinskaya, TSaxena, AFattorusso, C Exploiting protein fluctuations at the active-site gorge of human cholinesterases: further optimization of the design strategy to develop extremely potent inhibitors. J Med Chem51:3154-70 (2008) 
 
Acetylcholinesterase
Name:Acetylcholinesterase
Type:Enzyme
Mol. Mass.:67659.62
Organism:Bos taurus (bovine)
Description:n/a
Residue:613
BDBM8974
NameBDBM8974
Synonyms:CHEMBL367067 Tacrine Dimer 4j | methyl[3-(1,2,3,4-tetrahydroacridin-9-ylamino)propyl][3-(1,2,3,4-tetrahydroacridin-9-ylsulfanyl)propyl]amine
TypeSmall organic molecule
Emp. Form.C33H40N4S
Mol. Mass.524.763
SMILESCN(CCCNc1c2CCCCc2nc2ccccc12)CCCSc1c2CCCCc2nc2ccccc12