Reaction Details
TargetCholinesterase
LigandBDBM8974
Substrate/Competitorn/a
Meas. Tech.ChEMBL_552461 (CHEMBL1002721)
Ki 4.20±n/a nM
Citation Butini, SCampiani, GBorriello, MGemma, SPanico, APersico, MCatalanotti, BRos, SBrindisi, MAgnusdei, MFiorini, INacci, VNovellino, EBelinskaya, TSaxena, AFattorusso, C Exploiting protein fluctuations at the active-site gorge of human cholinesterases: further optimization of the design strategy to develop extremely potent inhibitors. J Med Chem51:3154-70 (2008) 
 
Cholinesterase
Name:Cholinesterase
Type:Enzyme
Mol. Mass.:65643.35
Organism:Equus caballus (Horse)
Description:P81908
Residue:574
BDBM8974
NameBDBM8974
Synonyms:CHEMBL367067 Tacrine Dimer 4j | methyl[3-(1,2,3,4-tetrahydroacridin-9-ylamino)propyl][3-(1,2,3,4-tetrahydroacridin-9-ylsulfanyl)propyl]amine
TypeSmall organic molecule
Emp. Form.C33H40N4S
Mol. Mass.524.763
SMILESCN(CCCNc1c2CCCCc2nc2ccccc12)CCCSc1c2CCCCc2nc2ccccc12