Reaction Details
TargetAcetylcholinesterase
LigandBDBM50369748
Substrate/Competitorn/a
Meas. Tech.ChEMBL_552470 (CHEMBL999087)
Ki 0.67±n/a nM
Citation Butini, SCampiani, GBorriello, MGemma, SPanico, APersico, MCatalanotti, BRos, SBrindisi, MAgnusdei, MFiorini, INacci, VNovellino, EBelinskaya, TSaxena, AFattorusso, C Exploiting protein fluctuations at the active-site gorge of human cholinesterases: further optimization of the design strategy to develop extremely potent inhibitors. J Med Chem51:3154-70 (2008) 
 
Acetylcholinesterase
Name:Acetylcholinesterase
Type:Enzyme
Mol. Mass.:67792.70
Organism:Homo sapiens (Human)
Description:P22303
Residue:614
BDBM50369748
NameBDBM50369748
Synonyms:CHEMBL208599
TypeSmall organic molecule
Emp. Form.C18H19ClN2
Mol. Mass.298.81
SMILESCCC1=CC2C[C@H](C1)c1c(C2)nc2cc(Cl)ccc2c1N