Reaction Details
TargetAcetylcholinesterase
LigandBDBM50377920
Substrate/Competitorn/a
Meas. Tech.ChEMBL_552464 (CHEMBL1002724)
Ki 8.90±n/a nM
Citation Butini, SCampiani, GBorriello, MGemma, SPanico, APersico, MCatalanotti, BRos, SBrindisi, MAgnusdei, MFiorini, INacci, VNovellino, EBelinskaya, TSaxena, AFattorusso, C Exploiting protein fluctuations at the active-site gorge of human cholinesterases: further optimization of the design strategy to develop extremely potent inhibitors. J Med Chem51:3154-70 (2008) 
 
Acetylcholinesterase
Name:Acetylcholinesterase
Type:Enzyme
Mol. Mass.:68165.65
Organism:Mus musculus (mouse)
Description:n/a
Residue:614
BDBM50377920
NameBDBM50377920
Synonyms:CHEMBL540657
TypeSmall organic molecule
Emp. Form.C42H45N8
Mol. Mass.661.8598
SMILESNc1ccc2c(c1)c(-c1ccccc1)n(CCCCCCc1cn(CCNc3c4CCCCc4nc4ccccc34)nn1)c1cc(=[NH2+])ccc21