Reaction Details
TargetP2Y purinoceptor 6
LigandBDBM50205413
Substrate/Competitorn/a
Meas. Tech.ChEMBL_552859 (CHEMBL958064)
EC50 1160±n/a nM
Citation Ko, HCarter, RLCosyn, LPetrelli, Rde Castro, SBesada, PZhou, YCappellacci, LFranchetti, PGrifantini, MVan Calenbergh, SHarden, TKJacobson, KA Synthesis and potency of novel uracil nucleotides and derivatives as P2Y2 and P2Y6 receptor agonists. Bioorg Med Chem16:6319-32 (2008) 
 
P2Y purinoceptor 6
Name:P2Y purinoceptor 6
Type:PROTEIN
Mol. Mass.:36452.29
Organism:Homo sapiens (Human)
Description:ChEMBL_1511151
Residue:328
BDBM50205413
NameBDBM50205413
Synonyms:CHEMBL221326 P1,P4-Bis(5'-uridyl) tetrahydrogen tetraphosphate
TypeSmall organic molecule
Emp. Form.C18H26N4O23P4
Mol. Mass.790.3071
SMILESO[C@@H]1[C@@H](COP(O)(=O)OP(O)(=O)OP(O)(=O)OP(O)(=O)OC[C@H]2O[C@H]([C@H](O)[C@@H]2O)n2ccc(=O)[nH]c2=O)O[C@H]([C@@H]1O)n1ccc(=O)[nH]c1=O