Reaction Details
TargetAcetylcholinesterase
LigandBDBM50271142
Substrate/Competitorn/a
Meas. Tech.ChEMBL_552871 (CHEMBL960588)
IC50 0.09±n/a nM
Citation Camps, PFormosa, XGaldeano, CGómez, TMuñoz-Torrero, DScarpellini, MViayna, EBadia, AClos, MVCamins, APallàs, MBartolini, MMancini, FAndrisano, VEstelrich, JLizondo, MBidon-Chanal, ALuque, FJ Novel donepezil-based inhibitors of acetyl- and butyrylcholinesterase and acetylcholinesterase-induced beta-amyloid aggregation. J Med Chem51:3588-98 (2008) 
 
Acetylcholinesterase
Name:Acetylcholinesterase
Type:Enzyme
Mol. Mass.:67659.62
Organism:Bos taurus (bovine)
Description:n/a
Residue:613
BDBM50271142
NameBDBM50271142
Synonyms:6-Chloro-9-[(3-{4-[(5,6-Dimethoxy-1-oxoindan-2-yl)methyl]piperidin-1-yl}propyl)amino]-1,2,3,4-tetrahydroacridine dihydrochloride | CHEMBL502725
TypeSmall organic molecule
Emp. Form.C33H40ClN3O3
Mol. Mass.562.142
SMILESCOc1cc2CC(CC3CCN(CCCNc4c5CCCCc5nc5cc(Cl)ccc45)CC3)C(=O)c2cc1OC