Reaction Details
TargetGlycylpeptide N-tetradecanoyltransferase
LigandBDBM50034993
Substrate/Competitorn/a
Meas. Tech.ChEMBL_507080 (CHEMBL946589)
IC50 24±n/a nM
Citation Wu, JTao, YZhang, MHoward, MHGutteridge, SDing, J Crystal structures of Saccharomyces cerevisiae N-myristoyltransferase with bound myristoyl-CoA and inhibitors reveal the functional roles of the N-terminal region. J Biol Chem282:22185-94 (2007) 
 
Glycylpeptide N-tetradecanoyltransferase
Name:Glycylpeptide N-tetradecanoyltransferase
Type:PROTEIN
Mol. Mass.:52840.42
Organism:Saccharomyces cerevisiae
Description:ChEMBL_507080
Residue:455
BDBM50034993
NameBDBM50034993
Synonyms:(S)-6-Amino-2-[(S)-3-hydroxy-2-(2-{4-[4-(2-methyl-imidazol-1-yl)-butyl]-phenyl}-acetylamino)-propionylamino]-hexanoic acid (2-cyclohexyl-ethyl)-amide SC-58272 | [CYCLOHEXYLETHYL]-[[[[4-[2-METHYL-1-IMIDAZOLYL-BUTYL]PHENYL]ACETYL]-SERYL]-LYSINYL]-AMINE
TypeSmall organic molecule
Emp. Form.C33H52N6O4
Mol. Mass.596.8038
SMILESCc1nccn1CCCCc1ccc(CC(=O)N[C@@H](CO)C(=O)N[C@@H](CCCCN)C(=O)NCCC2CCCCC2)cc1