Reaction Details
TargetPro-cathepsin H
LigandBDBM50157741
Substrate/Competitorn/a
Meas. Tech.ChEMBL_508135 (CHEMBL1004872)
IC50 190±n/a nM
Citation Méthot, NRubin, JGuay, DBeaulieu, CEthier, DReddy, TJRiendeau, DPercival, MD Inhibition of the activation of multiple serine proteases with a cathepsin C inhibitor requires sustained exposure to prevent pro-enzyme processing. J Biol Chem282:20836-46 (2007) 
 
Pro-cathepsin H
Name:Pro-cathepsin H
Type:PROTEIN
Mol. Mass.:37402.31
Organism:Homo sapiens (Human)
Description:ChEMBL_1459870
Residue:335
BDBM50157741
NameBDBM50157741
Synonyms:CHEMBL374508 E64
TypeSmall organic molecule
Emp. Form.C15H27N5O5
Mol. Mass.357.4054
SMILES[#6]-[#6](-[#6])-[#6]-[#6@H](-[#7]-[#6](=O)-[#6@H]-1-[#8]-[#6@@H]-1-[#6](-[#8])=O)-[#6](=O)-[#7]-[#6]-[#6]-[#6]-[#6]\[#7]=[#6](/[#7])-[#7]