Reaction Details
TargetMyeloblastin
LigandBDBM50269858
Substrate/Competitorn/a
Meas. Tech.ChEMBL_508159 (CHEMBL1008217)
IC50 4550±n/a nM
Citation Méthot, NRubin, JGuay, DBeaulieu, CEthier, DReddy, TJRiendeau, DPercival, MD Inhibition of the activation of multiple serine proteases with a cathepsin C inhibitor requires sustained exposure to prevent pro-enzyme processing. J Biol Chem282:20836-46 (2007) 
 
Myeloblastin
Name:Myeloblastin
Type:PROTEIN
Mol. Mass.:27628.93
Organism:Mus musculus
Description:ChEMBL_508159
Residue:254
BDBM50269858
NameBDBM50269858
Synonyms:Trifluoro-acetate(S)-1-((1S,2S)-1-cyano-2-phenyl-cyclopropylcarbamoyl)-2-(2-fluoro-phenyl)-ethyl-ammonium
TypeSmall organic molecule
Emp. Form.C19H19FN3O
Mol. Mass.324.3715
SMILES[NH3+][C@@H](Cc1ccccc1F)C(=O)N[C@]1(C[C@H]1c1ccccc1)C#N