Reaction Details
TargetSolute carrier family 22 member 20
LigandBDBM50269963
Substrate/Competitorn/a
Meas. Tech.ChEMBL_508178 (CHEMBL1008236)
Ki 315000±n/a nM
Citation Kaler, GTruong, DMKhandelwal, ANagle, MEraly, SASwaan, PWNigam, SK Structural variation governs substrate specificity for organic anion transporter (OAT) homologs. Potential remote sensing by OAT family members. J Biol Chem282:23841-53 (2007) 
 
Solute carrier family 22 member 20
Name:Solute carrier family 22 member 20
Type:PROTEIN
Mol. Mass.:60953.19
Organism:Mus musculus
Description:ChEMBL_508178
Residue:556
BDBM50269963
NameBDBM50269963
Synonyms:2-hydroxy-3-methylbutanoate
TypeSmall organic molecule
Emp. Form.C5H9O3
Mol. Mass.117.1237
SMILESCC(C)C(O)C([O-])=O