Reaction Details
TargetSolute carrier family 22 member 20
LigandBDBM22360
Substrate/Competitorn/a
Meas. Tech.ChEMBL_508178 (CHEMBL1008236)
Ki 102329±n/a nM
Citation Kaler, GTruong, DMKhandelwal, ANagle, MEraly, SASwaan, PWNigam, SK Structural variation governs substrate specificity for organic anion transporter (OAT) homologs. Potential remote sensing by OAT family members. J Biol Chem282:23841-53 (2007) 
 
Solute carrier family 22 member 20
Name:Solute carrier family 22 member 20
Type:PROTEIN
Mol. Mass.:60953.19
Organism:Mus musculus
Description:ChEMBL_508178
Residue:556
BDBM22360
NameBDBM22360
Synonyms:2-(acetyloxy)benzoate Acetylsalicylic acid Endosprin Zorprin cid_2244
TypeAnti-Inflammatory Agents, Non-Steroidal
Emp. Form.C9H8O4
Mol. Mass.180.1574
SMILESCC(=O)Oc1ccccc1C(O)=O