Reaction Details
TargetSolute carrier family 22 member 20
LigandBDBM26109
Substrate/Competitorn/a
Meas. Tech.ChEMBL_508178 (CHEMBL1008236)
Ki 82000±n/a nM
Citation Kaler, GTruong, DMKhandelwal, ANagle, MEraly, SASwaan, PWNigam, SK Structural variation governs substrate specificity for organic anion transporter (OAT) homologs. Potential remote sensing by OAT family members. J Biol Chem282:23841-53 (2007) 
 
Solute carrier family 22 member 20
Name:Solute carrier family 22 member 20
Type:PROTEIN
Mol. Mass.:60953.19
Organism:Mus musculus
Description:ChEMBL_508178
Residue:556
BDBM26109
NameBDBM26109
Synonyms:Butyrate butanoic acid, 4
TypeSmall organic molecule
Emp. Form.C4H8O2
Mol. Mass.88.1051
SMILESCCCC(O)=O