Reaction Details
TargetSolute carrier family 22 member 20
LigandBDBM19473
Substrate/Competitorn/a
Meas. Tech.ChEMBL_508178 (CHEMBL1008236)
Ki 271000±n/a nM
Citation Kaler, GTruong, DMKhandelwal, ANagle, MEraly, SASwaan, PWNigam, SK Structural variation governs substrate specificity for organic anion transporter (OAT) homologs. Potential remote sensing by OAT family members. J Biol Chem282:23841-53 (2007) 
 
Solute carrier family 22 member 20
Name:Solute carrier family 22 member 20
Type:PROTEIN
Mol. Mass.:60953.19
Organism:Mus musculus
Description:ChEMBL_508178
Residue:556
BDBM19473
NameBDBM19473
Synonyms:2-Oxopropanoate Pyruvate
TypeSmall organic molecule
Emp. Form.C3H4O3
Mol. Mass.88.0621
SMILESCC(=O)C(O)=O