Reaction Details
TargetSolute carrier family 22 member 20
LigandBDBM50009999
Substrate/Competitorn/a
Meas. Tech.ChEMBL_508178 (CHEMBL1008236)
Ki 312000±n/a nM
Citation Kaler, GTruong, DMKhandelwal, ANagle, MEraly, SASwaan, PWNigam, SK Structural variation governs substrate specificity for organic anion transporter (OAT) homologs. Potential remote sensing by OAT family members. J Biol Chem282:23841-53 (2007) 
 
Solute carrier family 22 member 20
Name:Solute carrier family 22 member 20
Type:PROTEIN
Mol. Mass.:60953.19
Organism:Mus musculus
Description:ChEMBL_508178
Residue:556
BDBM50009999
NameBDBM50009999
Synonyms:CHEMBL461 | N-benzoylglycine
TypeSmall organic molecule
Emp. Form.C9H9NO3
Mol. Mass.179.1727
SMILESOC(=O)CNC(=O)c1ccccc1