Reaction Details
TargetSolute carrier family 22 member 20
LigandBDBM16433
Substrate/Competitorn/a
Meas. Tech.ChEMBL_508178 (CHEMBL1008236)
Ki 9120±n/a nM
Citation Kaler, GTruong, DMKhandelwal, ANagle, MEraly, SASwaan, PWNigam, SK Structural variation governs substrate specificity for organic anion transporter (OAT) homologs. Potential remote sensing by OAT family members. J Biol Chem282:23841-53 (2007) 
 
Solute carrier family 22 member 20
Name:Solute carrier family 22 member 20
Type:PROTEIN
Mol. Mass.:60953.19
Organism:Mus musculus
Description:ChEMBL_508178
Residue:556
BDBM16433
NameBDBM16433
Synonyms:CHEMBL14184 Hexanoic acid | n-Caproic acid
TypeSmall organic molecule
Emp. Form.C6H12O2
Mol. Mass.116.1583
SMILESCCCCCC(O)=O