Reaction Details
TargetSolute carrier family 22 member 20
LigandBDBM50344958
Substrate/Competitorn/a
Meas. Tech.ChEMBL_508178 (CHEMBL1008236)
Ki 27542287.03±n/a nM
Citation Kaler, GTruong, DMKhandelwal, ANagle, MEraly, SASwaan, PWNigam, SK Structural variation governs substrate specificity for organic anion transporter (OAT) homologs. Potential remote sensing by OAT family members. J Biol Chem282:23841-53 (2007) 
 
Solute carrier family 22 member 20
Name:Solute carrier family 22 member 20
Type:PROTEIN
Mol. Mass.:60953.19
Organism:Mus musculus
Description:ChEMBL_508178
Residue:556
BDBM50344958
NameBDBM50344958
Synonyms:(S)-2-acetamidosuccinate N-Acetylaspartate
TypeSmall organic molecule
Emp. Form.C6H9NO5
Mol. Mass.175.1394
SMILESCC(=O)N[C@@H](CC(O)=O)C(O)=O