Reaction Details
TargetTissue factor
LigandBDBM50238632
Substrate/Competitorn/a
Meas. Tech.ChEMBL_508123 (CHEMBL1004860)
IC50 150±n/a nM
Citation Wang, JMahmud, SABitterman, PBHuo, YSlungaard, A Histone deacetylase inhibitors suppress TF-kappaB-dependent agonist-driven tissue factor expression in endothelial cells and monocytes. J Biol Chem282:28408-18 (2007) 
 
Tissue factor
Name:Tissue factor
Type:PROTEIN
Mol. Mass.:33067.61
Organism:Homo sapiens (Human)
Description:ChEMBL_936735
Residue:295
BDBM50238632
NameBDBM50238632
Synonyms:(6S,9S,12S,14aR)-6-((S)-sec-Butyl)-9-(1-methoxy-1H-indol-3-ylmethyl)-12-(6-oxo-octyl)-decahydro-4a,7,10,13-tetraaza-benzocyclododecene-5,8,11,14-tetraone ChEMBL_275631
TypeSmall organic molecule
Emp. Form.C34H49N5O6
Mol. Mass.623.7828
SMILESCC[C@H](C)[C@@H]1NC(=O)[C@H](Cc2cn(OC)c3ccccc23)NC(=O)[C@H](CCCCCC(=O)CC)NC(=O)[C@H]2CCCCN2C1=O