Reaction Details
TargetTissue factor
LigandBDBM50079401
Substrate/Competitorn/a
Meas. Tech.ChEMBL_508124 (CHEMBL1004861)
IC50 2000000±n/a nM
Citation Wang, JMahmud, SABitterman, PBHuo, YSlungaard, A Histone deacetylase inhibitors suppress TF-kappaB-dependent agonist-driven tissue factor expression in endothelial cells and monocytes. J Biol Chem282:28408-18 (2007) 
 
Tissue factor
Name:Tissue factor
Type:PROTEIN
Mol. Mass.:33067.61
Organism:Homo sapiens (Human)
Description:ChEMBL_936735
Residue:295
BDBM50079401
NameBDBM50079401
Synonyms:CHEMBL62381 Sodium; butyrate butyrate
TypeSmall organic molecule
Emp. Form.C4H7O2
Mol. Mass.87.0977
SMILESCCCC([O-])=O