Reaction Details
TargetHistone deacetylase 4
LigandBDBM19428
Substrate/Competitorn/a
Meas. Tech.ChEMBL_533714 (CHEMBL973336)
IC50 4±n/a nM
Citation Lahm, APaolini, CPallaoro, MNardi, MCJones, PNeddermann, PSambucini, SBottomley, MJLo Surdo, PCarfí, AKoch, UDe Francesco, RSteinkühler, CGallinari, P Unraveling the hidden catalytic activity of vertebrate class IIa histone deacetylases. Proc Natl Acad Sci U S A104:17335-40 (2007) 
 
Histone deacetylase 4
Name:Histone deacetylase 4
Type:Enzyme
Mol. Mass.:119049.39
Organism:Homo sapiens (Human)
Description:P56524
Residue:1084
BDBM19428
NameBDBM19428
Synonyms:(2E)-N-hydroxy-3-(4-{[(2-hydroxyethyl)[2-(1H-indol-3-yl)ethyl]amino]methyl}phenyl)prop-2-enamide CHEMBL356066 LAQ-824 | NVP-LAQ824
TypeSmall organic molecule
Emp. Form.C22H25N3O3
Mol. Mass.379.4522
SMILESOCCN(CCc1c[nH]c2ccccc12)Cc1ccc(\C=C\C(=O)NO)cc1