Reaction Details
TargetDipeptidyl peptidase 4
LigandBDBM50242476
Substrate/Competitorn/a
Meas. Tech.ChEMBL_534536 (CHEMBL985439)
IC50 6.2±n/a nM
Citation Fukushima, HHiratate, ATakahashi, MMikami, ASaito-Hori, MMunetomo, EKitano, KChonan, SSaito, HSuzuki, ATakaoka, YYamamoto, K Synthesis and structure-activity relationships of potent 4-fluoro-2-cyanopyrrolidine dipeptidyl peptidase IV inhibitors. Bioorg Med Chem16:4093-106 (2008) 
 
Dipeptidyl peptidase 4
Name:Dipeptidyl peptidase 4
Type:Enzyme
Mol. Mass.:88271.01
Organism:Homo sapiens (Human)
Description:P27487
Residue:766
BDBM50242476
NameBDBM50242476
Synonyms:CHEMBL471088 | N-[2-({2-[(2S,4S)-2-Cyano-4-fluoropyrrolidin-1-yl]-2-oxoethyl}amino)-2-methylpropyl]-N-(4-cyanobenzyl)benzamide
TypeSmall organic molecule
Emp. Form.C26H28FN5O2
Mol. Mass.461.5312
SMILESCC(C)(CN(Cc1ccc(cc1)C#N)C(=O)c1ccccc1)NCC(=O)N1C[C@@H](F)C[C@H]1C#N