Reaction Details
TargetDipeptidyl peptidase 4
LigandBDBM50242516
Substrate/Competitorn/a
Meas. Tech.ChEMBL_534536 (CHEMBL985439)
IC50 3.1±n/a nM
Citation Fukushima, HHiratate, ATakahashi, MMikami, ASaito-Hori, MMunetomo, EKitano, KChonan, SSaito, HSuzuki, ATakaoka, YYamamoto, K Synthesis and structure-activity relationships of potent 4-fluoro-2-cyanopyrrolidine dipeptidyl peptidase IV inhibitors. Bioorg Med Chem16:4093-106 (2008) 
 
Dipeptidyl peptidase 4
Name:Dipeptidyl peptidase 4
Type:Enzyme
Mol. Mass.:88271.01
Organism:Homo sapiens (Human)
Description:P27487
Residue:766
BDBM50242516
NameBDBM50242516
Synonyms:(2S,4S)-1-(N-Cyclobutylglycyl)-4-fluoropyrrolidine-2-carbonitrile | CHEMBL470476
TypeSmall organic molecule
Emp. Form.C11H16FN3O
Mol. Mass.225.2626
SMILESF[C@H]1C[C@@H](C#N)N(C1)C(=O)CNC1CCC1