Reaction Details
TargetDipeptidyl peptidase 4
LigandBDBM50242495
Substrate/Competitorn/a
Meas. Tech.ChEMBL_534536 (CHEMBL985439)
IC50 2.9±n/a nM
Citation Fukushima, HHiratate, ATakahashi, MMikami, ASaito-Hori, MMunetomo, EKitano, KChonan, SSaito, HSuzuki, ATakaoka, YYamamoto, K Synthesis and structure-activity relationships of potent 4-fluoro-2-cyanopyrrolidine dipeptidyl peptidase IV inhibitors. Bioorg Med Chem16:4093-106 (2008) 
 
Dipeptidyl peptidase 4
Name:Dipeptidyl peptidase 4
Type:Enzyme
Mol. Mass.:88271.01
Organism:Homo sapiens (Human)
Description:P27487
Residue:766
BDBM50242495
NameBDBM50242495
Synonyms:(2S,4S)-1-[N-(tert-Butyl)glycyl]-4-fluoropyrrolidine-2-carbonitrile | CHEMBL512726
TypeSmall organic molecule
Emp. Form.C11H18FN3O
Mol. Mass.227.2785
SMILESCC(C)(C)NCC(=O)N1C[C@@H](F)C[C@H]1C#N