Reaction Details
TargetDipeptidyl peptidase 4
LigandBDBM50242474
Substrate/Competitorn/a
Meas. Tech.ChEMBL_534536 (CHEMBL985439)
IC50 252±n/a nM
Citation Fukushima, HHiratate, ATakahashi, MMikami, ASaito-Hori, MMunetomo, EKitano, KChonan, SSaito, HSuzuki, ATakaoka, YYamamoto, K Synthesis and structure-activity relationships of potent 4-fluoro-2-cyanopyrrolidine dipeptidyl peptidase IV inhibitors. Bioorg Med Chem16:4093-106 (2008) 
 
Dipeptidyl peptidase 4
Name:Dipeptidyl peptidase 4
Type:Enzyme
Mol. Mass.:88271.01
Organism:Homo sapiens (Human)
Description:P27487
Residue:766
BDBM50242474
NameBDBM50242474
Synonyms:(2S,4S)-1-{N-[2-(Diethylamino)-1,1-dimethylethyl]glycyl}-4-fluoropyrrolidine-2-carbonitrile | CHEMBL511128
TypeSmall organic molecule
Emp. Form.C15H27FN4O
Mol. Mass.298.3995
SMILESCCN(CC)CC(C)(C)NCC(=O)N1C[C@@H](F)C[C@H]1C#N