Reaction Details
TargetDipeptidyl peptidase 4
LigandBDBM50242612
Substrate/Competitorn/a
Meas. Tech.ChEMBL_534536 (CHEMBL985439)
IC50 39±n/a nM
Citation Fukushima, HHiratate, ATakahashi, MMikami, ASaito-Hori, MMunetomo, EKitano, KChonan, SSaito, HSuzuki, ATakaoka, YYamamoto, K Synthesis and structure-activity relationships of potent 4-fluoro-2-cyanopyrrolidine dipeptidyl peptidase IV inhibitors. Bioorg Med Chem16:4093-106 (2008) 
 
Dipeptidyl peptidase 4
Name:Dipeptidyl peptidase 4
Type:Enzyme
Mol. Mass.:88271.01
Organism:Homo sapiens (Human)
Description:P27487
Residue:766
BDBM50242612
NameBDBM50242612
Synonyms:(2S,4S)-4-Fluoro-1-(N-{2-[(4-cyanobenzyl)amino]-1,1-dimethylethyl}glycyl)pyrrolidine-2-carbonitrile | CHEMBL485828
TypeSmall organic molecule
Emp. Form.C19H24FN5O
Mol. Mass.357.4252
SMILESCC(C)(CNCc1ccc(cc1)C#N)NCC(=O)N1C[C@@H](F)C[C@H]1C#N