Reaction Details
TargetDipeptidyl peptidase 4
LigandBDBM50242595
Substrate/Competitorn/a
Meas. Tech.ChEMBL_534536 (CHEMBL985439)
IC50 1.5±n/a nM
Citation Fukushima, HHiratate, ATakahashi, MMikami, ASaito-Hori, MMunetomo, EKitano, KChonan, SSaito, HSuzuki, ATakaoka, YYamamoto, K Synthesis and structure-activity relationships of potent 4-fluoro-2-cyanopyrrolidine dipeptidyl peptidase IV inhibitors. Bioorg Med Chem16:4093-106 (2008) 
 
Dipeptidyl peptidase 4
Name:Dipeptidyl peptidase 4
Type:Enzyme
Mol. Mass.:88271.01
Organism:Homo sapiens (Human)
Description:P27487
Residue:766
BDBM50242595
NameBDBM50242595
Synonyms:CHEMBL487860 | N-[2-({2-[(2S,4S)-2-Cyano-4-fluoropyrrolidin-1-yl]-2-oxoethyl}amino)-2-methylpropyl]-1H-1,2,3-benzotriazole-5-carboxamide
TypeSmall organic molecule
Emp. Form.C18H22FN7O2
Mol. Mass.387.4114
SMILESCC(C)(CNC(=O)c1ccc2nn[nH]c2c1)NCC(=O)N1C[C@@H](F)C[C@H]1C#N